IssueThat ER Manages
type: Class
comment: The Internal Regulation (IR), of JPC IM, provided the structure and governing rules for the proper operation of the faculty. All regulations approved by the Faculty Staff (FS).

DepartmentEvaluation
type: Class
subclass of: Evaluation
comment: At the completion of their studies, students evaluate the (JPC IM) Master.

ExternalAssociate
type: Class
equivalent class: Restriction
  has value: Not this period
  on property: FS Member of JPC IM
subclass of: Instructor

FS Member of JPC IM
type: DatatypeProperty
type: FunctionalProperty
range: DataRange
  one of: Not this period
  one of: Yes this period
domain: Instructor

Instructor
type: Class
comment: Here we will put all the Instructors
subclass of: Person

Collection Of Candidates Necessary Documents
type: Class
subclass of: Student Acceptance Process
comment: The documents that must be submitted to the principal by the candidates are:

RequiredEconomicsDirection
type: Class
subclass of: Lesson
equivalent class: Class
  intersection of: Restriction
    has value: Required for Economics Direction
    on property: Lesson Status
  intersection of: Restriction
    on property: Semester
    has value: 1

Lesson
type: Class
comment: Each of the offered courses include three (3) hours of instruction per week, equivalent to one (1) credit.
comment: Each course should have at least 1 Instructor and a maximum 2 Instructors.
comment: Is defined as less number of postgraduate students the seven (7) people to take place a lesson and maximum number of students, twenty-five (25) per class.
comment: The monitoring of cources, labs and other activities of the JCP IM is obligatory. All cources are offered every six months and either the autumn or the spring semeste. Includes and thirteen (13) weeks of teaching, tutorials, labs, discussions, exercises or operations where this is required.
equivalent class: Class
  intersection of: Restriction
    min cardinality: 1
    on property: Taught by
  intersection of: Restriction
    on property: Taught by
    max cardinality: 2
  intersection of: Restriction
    min cardinality: 2
    on property: Attending of
  intersection of: Restriction
    on property: Attending of
    max cardinality: 7

Lesson Status
type: DatatypeProperty
domain: Lesson
range: DataRange
  one of: Required for Economics Direction
  one of: Required for Informatics Direction
  one of: Optional
comment: Indicates whether a course is Optional or Required for the Information or Economic direction.
type: FunctionalProperty
sub property of: A Lesson Info

Semester
type: DatatypeProperty
domain: Lesson
type: FunctionalProperty
range: DataRange
  one of: 1
  one of: 2
  one of: 3
sub property of: A Lesson Info
comment: Every course belongs to the first, second or third semester

CandidateStudentEvaluation
type: Class
equivalent class: Restriction
  on property: inverse of Student Valuation Info
  cardinality: 1
comment: Each evaluation corresponding to one Student. On the other hand, each student can have many evaluations (1 for each academic year).
subclass of: Evaluation

Process To Attend JPC IM
type: Class
subclass of: General Attendance Process Of JPC IM
comment: Student's of first and second semester who rejected (either due to a passing grade, or absence) in one, two or at most three courses (2 semesters in aggregate) will be examined in next September.
comment: Students with backgrounds of Finance / Informatics courses may be examined in most in one course of their direction in September.
comment: The examinations performed over a period of two (2) weeks. Also in exceptional cases, the duration of teaching can be reduced by three (3) weeks at most.
comment: If the absences of a student in a course is up to four (4), then he can give the course in the examinations of September. If the absences are more than four (4) the student shall be deleted.

General Attendance Process Of JPC IM
type: Class
comment: The MSc is awarded to graduate students who have successfully examined in twelve (12) courses and have developed successful their Graduate Thesis.
comment: The MSc degree is awarded 3 (three) times a year during April, July and October.
comment: The final grade of MSc is calculated by 12/16 as the average of scores of courses and by 4 / 16 on the rating of Master Thesis.
comment: To obtain the MSc, postgraduate student is required to successfully examined in 12 courses. That five (5) are obligatory courses of the first semester and seven (7) optional courses of the second and third semester
subclass of: DepartmentProcedure

GradeOfStudentPerCourse
type: Class
comment: Here placed students degrees for each class who had attended.

Procces To Gain Scholarship
type: Class
comment: The scholarships are semi. The scholarships are awarded every semester and after the valuation of students performance.
comment: By decision of the Faculty Staff (FS) are defined by year, the number and amount of scholarships that awarded to postgraduate students.
comment: The JPC IM can provide a scholarship to postgraduate students for rewarding their performance and / or creating incentives for better performance of postgraduate students
subclass of: General Attendance Process Of JPC IM

Taught by
type: ObjectProperty
range: Instructor
comment: Το μάθημα διδάσκετε από τον Καθηγητή
sub property of: Lesson Info
domain: Lesson
inverse of: Is Teaching

Attending of
type: ObjectProperty
sub property of: Lesson Info
comment: Το μάθημα παρακολουθείται από τους Φοιτητές
inverse of: inverse of Attending of

PostgraduateStudentSelection
type: Class
comment: Furthermore the number of students that accepted are 2 candidates of National Institute of Scholarships and 2 foreign scholars students of the Greek state, with a degree in Computer Science and a degree in Economics.
comment: Candidates can be accepted and graduates from Technical Universities Schools and Military Schools of four years study in excess of 5% of the total number of students.
comment: In JPC IM are accepted graduates from Departments of Computer Science, Department of Electrical Engineering and Computer Science, Managment and Economic Sciences or relevant and equal departments of a foreign university and Technological Educational Institute graduates of the resident.
comment: Postgraduate Student of the JPC IM is the one who after the evaluating of hes application for admission was accepted.
subclass of: IssueThat ER Manages

List of Students for the Financial Direction of the Period
type: Class
equivalent class: Restriction
  on property: Is Financial Direction Student
  max cardinality: 21
subclass of: List of Graduate Students

List of Graduate Students
type: Class
subclass of: PostgraduateStudentSelection
comment: The number of admitted students to the JPC IM defined at the first academic year to 20 graduates of IT departments and 20 graduate of departments of Management and/or Economic Sciences.

InstructorEvaluation
type: Class
comment: Every instructor evaluated by studens, at the end of each semester with the completing of a special questionnaire.
equivalent class: Restriction
  on property: inverse of Teacher Valuation Info
  cardinality: 1
subclass of: Evaluation

OptionalLesson
type: Class
equivalent class: Restriction
  has value: Optional
  on property: Lesson Status
subclass of: Lesson

Process For Successful Integration The Courses
type: Class
comment: The degrees of success in the graduate courses are in the range 0-10. Pass score is a six (6) for the postgraduate courses.
comment: If the absences of a student in a course is up to four (4) he/she can give the course in the examinations of September.
comment: In cases where a postgraduate student is absent for more than two (2) weeks of teaching a lesson, then excluded from the examination of this course in the standard period tests.
comment: All Postgraduate classes lasting six months and include teaching lessons of thirteen (13) weeks
comment: The courses attendance, the laboratory courses and other activities of the JPC IM is obligatory.
subclass of: DepartmentProcedure

DepartmentProcedure
type: Class
comment: The Joint Postgraduate Course on “Informatics and Management” (JPC IM) of Aristotle University of Thessaloniki (AUTH) confers a Master of science (MSc).
comment: The Joint Postgraduate Course on “Informatics and Management” (JPC IM) of Aristotle University of Thessaloniki, Greece provides a high level of knowledge in cutting-edge IT and Management and also upgrading the research in this scientific field.
subclass of: IssueThat ER Manages

OtherPerson
type: Class
comment: Here we will put all those in some other status
subclass of: Person

Process Of Abortion Studies
type: Class
subclass of: General Attendance Process Of JPC IM
comment: 4) was examined unsuccessful in at least one course in September after the first year of study or 5) has been examined unsuccessfully for a course in June after the third semester 6) has more than four (4) absences in a course
comment: 1) failed to successfully examined in twelve (12) courses (paragraph 2 of this article), or 2) failed to successfully examined the Graduate Thesis, or 3) has been examined unsuccessfully more than three courses in the aggregate first and second semester, or
comment: The studies of a student interrupted by a decision of the FS at the suggestion of ICCPS. In the following cases:

AcademicPeriodLessonList
type: Class
comment: The minimum number of courses taught for a year is 12 and maximum 22. For the fall semester we have: 5 for each direction, a total of 10 and 4 optional for students attending the third semester. Also there are other 8 optional for the summer semester.
equivalent class: Class
  intersection of: Restriction
    min cardinality: 12
    on property: Academic period Lesson List
  intersection of: Restriction
    max cardinality: 22
    on property: Academic period Lesson List

InformaticsDirectionStudent
type: Class
comment: Students from departments on economic sciences follow the direction of Informatics.
subclass of: PostgraduateStudentSelection
equivalent class: Class
  intersection of: Restriction
    has value: true
    on property: Student who Pass the Valuation
  intersection of: EconomicsCandidateStudent

Student who Pass the Valuation
type: FunctionalProperty
type: DatatypeProperty
domain: Student
range: DataRange
  one of: true
  one of: false

EconomicsCandidateStudent
type: Class
comment: Prospective graduate students of Informatics direction are those that hasc a economics Degree.
equivalent class: Class
  intersection of: Student
  intersection of: Restriction
    on property: inverse of Attending FD
    cardinality: 5
  intersection of: Class
    complement of: Restriction
      has value: CSD
      on property: Coming from Department of

EconomicsDirectionStudent
type: Class
subclass of: PostgraduateStudentSelection
comment: The students from departments of the Computer Science and follow direction of Economics.
equivalent class: Class
  intersection of: Restriction
    on property: Student who Pass the Valuation
    has value: true
  intersection of: InformaticsCandidateStudent

InformaticsCandidateStudent
type: Class
comment: Prospective graduate students of Economics direction are those that hasc a Informatics Degree.
equivalent class: Class
  intersection of: Student
  intersection of: Restriction
    cardinality: 5
    on property: inverse of Attending CSD
  intersection of: Class
    complement of: Restriction
      on property: Coming from Department of
      has value: FD

MasterThesis
type: Class
comment: The thesis for students in the third semester must be submitted until March 15.
comment: The Master Thesis may be a research or have a technical content and must have a sufficient degree of originality or demonstrating the good knowledge and understanding in depth of a specific topic or current research or technical interest.
comment: Graduate students enrolled in the third semester of studies assume to develop a Master Thesis.

List of Students for the Informatics Direction of the Period
type: Class
equivalent class: Restriction
  on property: Is Informatics Direction Student
  max cardinality: 21
subclass of: List of Graduate Students

Student
type: Class
equivalent class: Class
  intersection of: Restriction
    on property: inverse of Supervising Member from Economics FS
    cardinality: 1
  intersection of: Restriction
    on property: inverse of Supervising Member from Informatics FS
    cardinality: 1
  intersection of: Restriction
    on property: Student Valuation Info
    min cardinality: 1
  intersection of: Restriction
    on property: inverse of Attending Optional
    cardinality: 7
comment: Each candidate student can have many evaluations applications for admission to Graduate Program (1 per academic year). On the other hand, each evaluation corresponds to one student.
comment: In each postgraduate student correspond two faculty members, one from the Department of Computer Science and one from the Department of Economics and defined as supervisors.
comment: Each student monitors just 12 lessons. Of these, 7 are electives and 5 are obligatory of hes studies direction.
subclass of: Person

RequiredInformaticsDirection
type: Class
subclass of: Lesson
equivalent class: Class
  intersection of: Restriction
    has value: Required for Informatics Direction
    on property: Lesson Status
  intersection of: Restriction
    has value: 1
    on property: Semester

Process That Secretariat Arranges
type: Class
comment: The secretariat of the JPC IM which assists the Governing Board (GB) must do:
subclass of: Student Acceptance Process

MemderOfInformatics FS
type: Class
subclass of: FacultyStaff
comment: Each faculty member of Informatics may not be supervising more than seven (7) postgraduate students per academic year of JPC IM.
equivalent class: Restriction
  on property: Supervising Member from Informatics FS
  max cardinality: 7

LessonEvaluation
type: Class
comment: The evaluation made ??at the end of each semester by completing a questionnaire by each student that attending the course.
subclass of: Evaluation
equivalent class: Restriction
  on property: inverse of Lesson Valuation Info
  cardinality: 1

Professor
type: Class
subclass of: JPC IM Director
equivalent class: Restriction
  on property: Instractor With Rank
  has value: Professor

JPC IM Director
type: Class
subclass of: DepartmentAdministration
equivalent class: Class
  union of: Associate Professor
  union of: Professor
comment: The position occupied by a faculty member from the two highest grades (Professor or Associate Professor) from the Department of Computer Science.

Instractor With Rank
type: DatatypeProperty
domain: Instructor
comment: This indicates the rank of the Instractor
range: DataRange
  one of: Adjunct Lecturer
  one of: Lecturer
  one of: Assistant Professor
  one of: Associate Professor
  one of: Professor Emeritus
  one of: Professor
type: FunctionalProperty

Process For Lesson Examination
type: Class
subclass of: Process For Successful Integration The Courses
comment: The grades are published within fifteen days after the end of each examination period.
comment: The examinations performed in accordance the curriculum that prepared by the ICCPS and announced a month before onset.

Student Selection Process
type: Class
comment: Responsible for the selection of candidates is the Governing Board (GB) and decide for:
subclass of: Student Acceptance Process

Coming from Department of
type: DatatypeProperty
sub property of: A Person Info
range: DataRange
  one of: CSD
  one of: FD
  one of: Other
type: FunctionalProperty
comment: Καεύθυνση ειδικότητας.
domain: Student

ICCPS Secretariat
type: Class
subclass of: DepartmentAdministration
comment: Ensure supervision and overall coordination of postgraduate studies.
comment: Registry of JPC IM composed by a member of the secretariat of the Informatics Department and a member of the secretariat of the Economic Department. Any committee of the JPC IM assisted by a decision of the Director of each Department.
comment: Secretary of ICCPS is set the current Secretary of the Informatics Department.

Associate Professor
type: Class
subclass of: JPC IM Director
equivalent class: Restriction
  has value: Associate Professor
  on property: Instractor With Rank

Process For MasterThesis Examination
type: Class
comment: In the E' semester the Master Thesis will be submitted until 15 January and will be reviewed by the end of the month.
comment: During the fourth semester the Master Thesis will be submitted by June 15 and if it is not in time in the first half of September and will be reviewed during the second half of those months.
comment: The thesis for students in the third semester be submitted until March 15 and reviewed in the second half of March.
comment: The Master thesis is examined by three-member committee appointed by the IICCPS. The examination committee established by the supervisor instuctor and two faculty members with relative academic field to the issue of the Graduate Thesis.
subclass of: Process For Successful Integration The Courses

ICCPS
type: Class
comment: Interdepartmental Coordinating Committee of Postgraduate Studies (ICCPS)
comment: Their term of office are for two years. Beginning September 1 of the first year and ending on August 31 of the second.
comment: By decision of the Governing Board (GB) the ICCPS is composed from three members.The Director of JPC IM, a member of the Faculty of Informatics and a member of the Faculty of Economics.
subclass of: DepartmentAdministration

MemderOfEconomics FS
type: Class
comment: Each faculty member of Economics may not be supervising more than seven (7) postgraduate students per academic year of JPC IM.
subclass of: FacultyStaff
equivalent class: Restriction
  on property: Supervising Member from Economics FS
  max cardinality: 7

Governing Board
type: Class
equivalent class: Class
  intersection of: Restriction
    on property: FS Member of JPC IM
    has value: Yes this period
  intersection of: Restriction
    on property: Member of Economics GB
    cardinality: 3
  intersection of: Restriction
    cardinality: 4
    on property: Member of Informatics GB
comment: Governing Board (GB) is responsible for adopting recommendations and proposals on issues of postgraduate studies, the definition of members of various committees, the selection of prospective students, the curriculum, instruction and assignments for the award of MSc.
comment: The Governing Board (GB) composed of 7 members. The 4 members are from the faculty of the Informatics Department and the other 3 members of the faculty of Economics Department.
subclass of: DepartmentAdministration

Process For Lesson Reappraisal
type: Class
subclass of: Process For Successful Integration The Courses
comment: Student of the third semester which is rejected (either because of a no passing grade, or because of absences) to a maximum of one course of this semester he can be reexamined in the next June.
comment: For courses in which the student was dismissed due to absences, he must submit before the examinations of September all the homeworks set to the corresponding Instructors.

Supervising faculty member for Student
type: ObjectProperty
comment: Εντός του πρώτου τριμήνου φοίτησης ορίζονται για κάθε μεταπτυχιακό φοιτητή δύο μέλη ΔΕΠ, ένας από το Τμήμα Πληροφορικής και ένας από το Τμήμα Οικονομικών Επιστημών. Το κάθε μέλος ΔΕΠ δεν μπορεί να είναι επιβλέπων περισσοτέρων των επτά (7) μεταπτυχιακών φοιτητών ανά έτος του ΔΠΜΣ.
comment: Επιβλέποντα μέλη ΔΕΠ
inverse of: inverse of Supervising faculty member for Student
sub property of: Is a Person

A Student valuation Info
type: DatatypeProperty
comment: Information on evaluation criteria for the candidates to be accepted to the JPC IM
sub property of: Valuations

Weight for Language learning
type: DatatypeProperty
sub property of: Weight for Student valuation Info
range: DataRange
  one of: 0.15
type: FunctionalProperty

Academic Semester
type: DatatypeProperty
domain: AcademicPeriod
type: FunctionalProperty
range: DataRange
  one of: first semester
  one of: second semester

Weight for Interview
type: DatatypeProperty
type: FunctionalProperty
range: DataRange
  one of: 0.07
sub property of: Weight for Student valuation Info

Weight for Publications
type: DatatypeProperty
type: FunctionalProperty
range: DataRange
  one of: 0.08
sub property of: Weight for Student valuation Info

Weight for Professional Activity
type: DatatypeProperty
type: FunctionalProperty
sub property of: Weight for Student valuation Info
range: DataRange
  one of: 0.05

Weight for GMAT
type: FunctionalProperty
range: DataRange
  one of: 0.25
sub property of: Weight for Student valuation Info
type: DatatypeProperty

Weight for Grade and Type of Degree
type: FunctionalProperty
type: DatatypeProperty
sub property of: Weight for Student valuation Info
range: DataRange
  one of: 0.4

Lesson Rating
type: FunctionalProperty
type: DatatypeProperty
sub property of: A Lesson Info
range: DataRange
  one of: 1
  one of: 2
  one of: 3
  one of: 4
  one of: 5
  one of: 6
  one of: 7
  one of: 8
  one of: 9
  one of: 10
domain: GradeOfStudentPerCourse

Has Degree Related to
type: FunctionalProperty
domain: Instructor
range: DataRange
  one of: CSD
  one of: FD
  one of: Other
type: DatatypeProperty
sub property of: A Person Info

Def Candidate Student who Pass the Valuation
type: Imp
is rule enabled: true
head: DatavaluedPropertyAtom
  property predicate: Student who Pass the Valuation
  argument1: y
  argument2: true
body: ClassAtom
  argument1: x
  class predicate: SuccessfulCandidateStudentEvaluation
body: IndividualPropertyAtom
  property predicate: inverse of Student Valuation Info
  argument1: x
  argument2: y
body: ClassAtom
  argument1: y
  class predicate: Student

Mrs Xenia
type: OtherPerson
coming from department of: Other

DataRange
one of: 0.25

Mr Butterfly
type: OtherPerson
coming from department of: Other

DataRange
one of: 0.08

Les Student Lessons Average
type: Imp
is rule enabled: true
body: ClassAtom
  argument1: o
  class predicate: OldCourses
body: IndividualPropertyAtom
  argument1: o
  argument2: p
  property predicate: Student Lesson Rating
body: ClassAtom
  class predicate: Student
  argument1: p
body: DatavaluedPropertyAtom
  property predicate: Lesson Rating
  argument1: o
  argument2: MyRate
body: BuiltinAtom
  arguments: MyBag
  arguments: MyRate
  builtin: makeBag
body: BuiltinAtom
  arguments: MyBag
  arguments: p
  builtin: groupBy
body: BuiltinAtom
  builtin: avg
  arguments: MyAvg
  arguments: MyBag
head: DatavaluedPropertyAtom
  property predicate: Student Lessons Average Rating
  argument2: MyAvg
  argument1: p
head: BuiltinAtom
  arguments: p
  arguments: MyAvg
  arguments: MyBag
  builtin: select

Def Base Candidates Evaluation
type: Imp
body: DatavaluedPropertyAtom
  property predicate: Valuation Average
  argument1: z
  argument2: sum
body: BuiltinAtom
  builtin: greaterThan
  arguments: sum
  arguments: 5
is rule enabled: false
head: DatavaluedPropertyAtom
  property predicate: Valuation Base Pass True
  argument1: z
  argument2: true
head: ClassAtom
  class predicate: SuccessfulCandidateStudentEvaluation
  argument1: z

DataRange
one of: 0.15

Selection of candidate students
type: Student Selection Process
comment: • qualification of candidates • supporting documents, • the time of publication of invitations to tender in the press • The deadline for applications • schedule evaluation of nominations and an invitation to interview • The deadline for entries.
comment: Responsible for the students selection is the Governing Board (GB)
academic period: Academic Period 2008-2009

Mrs Petridou
type: MemderOfEconomics FS
FS member of JPC IM: Yes this period
coming from department of: FD
teacher valuation info: Instructor Evaluation 2010
is teaching: Business Management
is teaching: Human Resource Management
instractor with rank: Associate Professor

Instructor Evaluation 2010
type: InstructorEvaluation
inverse of teacher valuation info: Mrs Petridou
avaluations average price: 6.7
academic period: Academic Period 2010-2011

Business Management
type: RequiredEconomicsDirection
taught by: Mrs Kirgidou
attending CSD: InformaticsCandidateStudent Test 22
lesson status: Required for Economics Direction
inverse of student lesson: GradeOfStudentPerCourse 28
semester: 1
lesson valuation info: Lesson Evaluation 2010
inverse of student lesson: GradeOfStudentPerCourse 13
inverse of student lesson: GradeOfStudentPerCourse 8
attending CSD: InformaticsCandidateStudent Test 1
attending CSD: InformaticsCandidateStudent Test 27
taught by: Mrs Petridou

Mrs Kirgidou
type: Members of the Scientific Staff of TEI
has degree related to: FD
FS member of JPC IM: Not this period
is teaching: Business Management
instractor with rank: Adjunct Lecturer

GradeOfStudentPerCourse 14
type: GradeOfStudentPerCourse
student lesson rating: InformaticsCandidateStudent Test 22
lesson rating: 6
student lesson: Financial Accounting

Financial Accounting
type: RequiredEconomicsDirection
inverse of student lesson: GradeOfStudentPerCourse 14
taught by: Mr Spathis
inverse of student lesson: GradeOfStudentPerCourse 29
attending CSD: InformaticsCandidateStudent Test 1
attending CSD: InformaticsCandidateStudent Test 27
lesson status: Required for Economics Direction
semester: 1
inverse of student lesson: GradeOfStudentPerCourse 9
attending CSD: InformaticsCandidateStudent Test 22

Mr Spathis
type: MemderOfEconomics FS
supervising member from economics FS: EconomicsCandidateStudent Test 41
FS member of JPC IM: Yes this period
is teaching: Internal control
is teaching: Financial Accounting
coming from department of: FD
instractor with rank: Associate Professor

Databases
type: RequiredInformaticsDirection
inverse of student lesson: GradeOfStudentPerCourse 2
lesson status: Required for Informatics Direction
semester: 1
attending FD: EconomicsCandidateStudent Test 41
inverse of student lesson: GradeOfStudentPerCourse 18
taught by: Mr Simeonidis
attending FD: EconomicsCandidateStudent Test 45
attending FD: EconomicsCandidateStudent Test 36
inverse of student lesson: GradeOfStudentPerCourse 23

GradeOfStudentPerCourse 2
type: GradeOfStudentPerCourse
lesson rating: 7
student lesson rating: EconomicsCandidateStudent Test 36
student lesson: Databases

Decision Support Systems
type: RequiredInformaticsDirection
taught by: Mr Vlahavas
attending FD: EconomicsCandidateStudent Test 36
inverse of student lesson: GradeOfStudentPerCourse 24
lesson status: Required for Informatics Direction
attending FD: EconomicsCandidateStudent Test 41
inverse of student lesson: GradeOfStudentPerCourse 3
attending FD: EconomicsCandidateStudent Test 45
semester: 1
inverse of student lesson: GradeOfStudentPerCourse 19

Mr Vlahavas
type: MemderOfInformatics FS
instractor with rank: Professor
supervising member from informatics FS: InformaticsCandidateStudent Test 27
is teaching: Decision Support Systems
coming from department of: CSD
FS member of JPC IM: Not this period

GradeOfStudentPerCourse 27
type: GradeOfStudentPerCourse
student lesson: Administrative accounting
lesson rating: 6
student lesson rating: InformaticsCandidateStudent Test 27

Administrative accounting
type: RequiredEconomicsDirection
attending CSD: InformaticsCandidateStudent Test 1
taught by: Mr Kousenidis
inverse of student lesson: GradeOfStudentPerCourse 7
attending CSD: InformaticsCandidateStudent Test 27
attending CSD: InformaticsCandidateStudent Test 22
semester: 1
lesson status: Required for Economics Direction
inverse of student lesson: GradeOfStudentPerCourse 12
inverse of student lesson: GradeOfStudentPerCourse 27

GradeOfStudentPerCourse 11
type: GradeOfStudentPerCourse
lesson rating: 7
student lesson rating: InformaticsCandidateStudent Test 1
student lesson: Marketing Management

Marketing Management
type: RequiredEconomicsDirection
attending CSD: InformaticsCandidateStudent Test 22
inverse of student lesson: GradeOfStudentPerCourse 31
inverse of student lesson: GradeOfStudentPerCourse 16
attending CSD: InformaticsCandidateStudent Test 1
attending CSD: InformaticsCandidateStudent Test 27
semester: 1
taught by: Mrs Boutzouki
inverse of student lesson: GradeOfStudentPerCourse 11
lesson status: Required for Economics Direction

GradeOfStudentPerCourse 31
type: GradeOfStudentPerCourse
lesson rating: 10
student lesson rating: InformaticsCandidateStudent Test 27
student lesson: Marketing Management

GradeOfStudentPerCourse 16
type: GradeOfStudentPerCourse
lesson rating: 4
student lesson rating: InformaticsCandidateStudent Test 22
student lesson: Marketing Management

Mrs Boutzouki
type: MemderOfEconomics FS
FS member of JPC IM: Yes this period
is teaching: Communication and Promotion
is teaching: Marketing Management
instractor with rank: Lecturer
coming from department of: FD

Communication and Promotion
type: OptionalLesson
taught by: Mr Hatzithomas
taught by: Mrs Boutzouki
lesson status: Optional

Human Resource Management
type: RequiredEconomicsDirection
attending CSD: InformaticsCandidateStudent Test 27
inverse of student lesson: GradeOfStudentPerCourse 30
taught by: Mrs Petridou
semester: 1
lesson status: Required for Economics Direction
inverse of student lesson: GradeOfStudentPerCourse 15
attending CSD: InformaticsCandidateStudent Test 22
attending CSD: InformaticsCandidateStudent Test 1
inverse of student lesson: GradeOfStudentPerCourse 10

GradeOfStudentPerCourse 30
type: GradeOfStudentPerCourse
lesson rating: 7
student lesson: Human Resource Management
student lesson rating: InformaticsCandidateStudent Test 27

GradeOfStudentPerCourse 15
type: GradeOfStudentPerCourse
lesson rating: 9
student lesson: Human Resource Management
student lesson rating: InformaticsCandidateStudent Test 22

GradeOfStudentPerCourse 10
type: GradeOfStudentPerCourse
student lesson rating: InformaticsCandidateStudent Test 1
student lesson: Human Resource Management
lesson rating: 7

GradeOfStudentPerCourse 9
type: GradeOfStudentPerCourse
lesson rating: 2
student lesson: Financial Accounting
student lesson rating: InformaticsCandidateStudent Test 1

Enterprise Management Operations
type: OptionalLesson
lesson status: Optional
taught by: Mr H Papadopoulos

GradeOfStudentPerCourse 8
type: GradeOfStudentPerCourse
lesson rating: 8
student lesson: Business Management
student lesson rating: InformaticsCandidateStudent Test 1

CandidateStudentEvaluation 8
type: CandidateStudentEvaluation
publications: 7.0
academic period: Academic Period 2010-2011
interview: 7.0
inverse of student valuation info: InformaticsCandidateStudent Test 1
grade and type of degree: 7.0
GMAT: 7.0
professional activity: 7.0
language learning: 7.0

Mr Stamelos
type: MemderOfInformatics FS
instractor with rank: Assistant Professor
FS member of JPC IM: Yes this period
supervising member from informatics FS: InformaticsCandidateStudent Test 1
coming from department of: CSD
is teaching: Information Technology Infrastructure

Information Technology Infrastructure
type: RequiredInformaticsDirection
lesson status: Required for Informatics Direction
inverse of student lesson: GradeOfStudentPerCourse 25
semester: 1
inverse of student lesson: GradeOfStudentPerCourse 21
attending FD: EconomicsCandidateStudent Test 36
taught by: Mr Stamelos
inverse of student lesson: GradeOfStudentPerCourse 4
attending FD: EconomicsCandidateStudent Test 41
attending FD: EconomicsCandidateStudent Test 45

GradeOfStudentPerCourse 25
type: GradeOfStudentPerCourse
student lesson rating: EconomicsCandidateStudent Test 45
lesson rating: 7
student lesson: Information Technology Infrastructure

CandidateStudentEvaluation 47
type: CandidateStudentEvaluation
academic period: Academic Period 2010-2011
professional activity: 6.0
inverse of student valuation info: EconomicsCandidateStudent Test 45
publications: 7.0
interview: 8.0
language learning: 8.0
grade and type of degree: 5.0
GMAT: 7.0

GradeOfStudentPerCourse 26
type: GradeOfStudentPerCourse
student lesson: Web Information Environments
lesson rating: 8
student lesson rating: EconomicsCandidateStudent Test 45

Web Information Environments
type: RequiredInformaticsDirection
attending FD: EconomicsCandidateStudent Test 45
inverse of student lesson: GradeOfStudentPerCourse 5
semester: 1
lesson status: Required for Informatics Direction
inverse of student lesson: GradeOfStudentPerCourse 20
attending FD: EconomicsCandidateStudent Test 36
taught by: Mrs Vakali
inverse of student lesson: GradeOfStudentPerCourse 26
attending FD: EconomicsCandidateStudent Test 41

GradeOfStudentPerCourse 5
type: GradeOfStudentPerCourse
student lesson: Web Information Environments
lesson rating: 3
student lesson rating: EconomicsCandidateStudent Test 36

GradeOfStudentPerCourse 20
type: GradeOfStudentPerCourse
lesson rating: 6
student lesson rating: EconomicsCandidateStudent Test 41
student lesson: Web Information Environments

Mrs Vakali
type: MemderOfInformatics FS
FS member of JPC IM: Yes this period
coming from department of: CSD
is teaching: Web Information Environments
instractor with rank: Associate Professor

Mr Tsadiras
type: MemderOfInformatics FS
supervising member from informatics FS: EconomicsCandidateStudent Test 45
is teaching: E-Commerce
is teaching: Business Information Systems
instractor with rank: Lecturer
FS member of JPC IM: Not this period
coming from department of: FD

E-Commerce
type: OptionalLesson
taught by: Mr Tsadiras
lesson status: Optional
lesson valuation info: Lesson Evaluation 2009

Lesson Evaluation 2009
type: LessonEvaluation
inverse of lesson valuation info: E-Commerce
academic period: Academic Period 2009-2010
avaluation comment: Improvement textbooks
avaluations average price: 5.6

Business Information Systems
type: RequiredInformaticsDirection
inverse of student lesson: GradeOfStudentPerCourse 1
inverse of student lesson: GradeOfStudentPerCourse 17
inverse of student lesson: GradeOfStudentPerCourse 22
lesson status: Required for Informatics Direction
semester: 1
taught by: Mr Tsadiras
attending FD: EconomicsCandidateStudent Test 36
taught by: Mr Laskaridis
attending FD: EconomicsCandidateStudent Test 41
attending FD: EconomicsCandidateStudent Test 45

GradeOfStudentPerCourse 1
type: GradeOfStudentPerCourse
student lesson: Business Information Systems
lesson rating: 6
student lesson rating: EconomicsCandidateStudent Test 36

GradeOfStudentPerCourse 17
type: GradeOfStudentPerCourse
student lesson rating: EconomicsCandidateStudent Test 41
lesson rating: 7
student lesson: Business Information Systems

GradeOfStudentPerCourse 22
type: OldCourses
student lesson: Business Information Systems
type: GradeOfStudentPerCourse
student lesson rating: EconomicsCandidateStudent Test 45
lesson rating: 10

CandidateStudentEvaluation 46
type: CandidateStudentEvaluation
inverse of student valuation info: EconomicsCandidateStudent Test 45
publications: 9.0
academic period: Academic Period 2009-2010
grade and type of degree: 4.0
professional activity: 8.0
interview: 4.0
language learning: 8.0
GMAT: 4.0

GradeOfStudentPerCourse 23
type: GradeOfStudentPerCourse
lesson rating: 8
student lesson rating: EconomicsCandidateStudent Test 45
student lesson: Databases

GradeOfStudentPerCourse 24
type: GradeOfStudentPerCourse
lesson rating: 9
student lesson: Decision Support Systems
student lesson rating: EconomicsCandidateStudent Test 45

Mr Kousenidis
type: MemderOfEconomics FS
is teaching: Administrative accounting
FS member of JPC IM: Not this period
instractor with rank: Associate Professor
supervising member from economics FS: EconomicsCandidateStudent Test 45
coming from department of: FD

GradeOfStudentPerCourse 21
type: GradeOfStudentPerCourse
student lesson rating: EconomicsCandidateStudent Test 41
student lesson: Information Technology Infrastructure
lesson rating: 10

GradeOfStudentPerCourse 4
type: GradeOfStudentPerCourse
student lesson: Information Technology Infrastructure
lesson rating: 9
student lesson rating: EconomicsCandidateStudent Test 36

GradeOfStudentPerCourse 7
type: GradeOfStudentPerCourse
student lesson rating: InformaticsCandidateStudent Test 1
lesson rating: 4
student lesson: Administrative accounting

GradeOfStudentPerCourse 12
type: GradeOfStudentPerCourse
lesson rating: 7
student lesson rating: InformaticsCandidateStudent Test 22
student lesson: Administrative accounting

Mrs Kosmidou
type: MemderOfEconomics FS
is teaching: Financial Analysis and Portfolio Theory
coming from department of: FD
supervising member from economics FS: InformaticsCandidateStudent Test 27
supervising member from economics FS: InformaticsCandidateStudent Test 22
instractor with rank: Lecturer
FS member of JPC IM: Not this period

Financial Analysis and Portfolio Theory
type: OptionalLesson
lesson status: Optional
taught by: Mrs Kosmidou

GradeOfStudentPerCourse 29
type: GradeOfStudentPerCourse
lesson rating: 4
student lesson rating: InformaticsCandidateStudent Test 27
student lesson: Financial Accounting

CandidateStudentEvaluation 28
type: CandidateStudentEvaluation
inverse of student valuation info: InformaticsCandidateStudent Test 27
academic period: Academic Period 2010-2011
grade and type of degree: 8.0
professional activity: 8.0
language learning: 8.0
publications: 8.0
GMAT: 8.0
interview: 8.0

GradeOfStudentPerCourse 28
type: GradeOfStudentPerCourse
student lesson: Business Management
student lesson rating: InformaticsCandidateStudent Test 27
lesson rating: 9

GradeOfStudentPerCourse 3
type: GradeOfStudentPerCourse
student lesson rating: EconomicsCandidateStudent Test 36
lesson rating: 8
student lesson: Decision Support Systems

GradeOfStudentPerCourse 19
type: GradeOfStudentPerCourse
student lesson rating: EconomicsCandidateStudent Test 41
student lesson: Decision Support Systems
lesson rating: 3

CandidateStudentEvaluation 37
type: CandidateStudentEvaluation
academic period: Academic Period 2009-2010
interview: 8.0
GMAT: 3.0
professional activity: 8.0
language learning: 7.0
publications: 7.0
inverse of student valuation info: EconomicsCandidateStudent Test 36
grade and type of degree: 8.0

CandidateStudentEvaluation 38
type: CandidateStudentEvaluation
interview: 9.0
GMAT: 5.0
grade and type of degree: 3.0
publications: 3.0
language learning: 8.0
professional activity: 5.0
inverse of student valuation info: EconomicsCandidateStudent Test 36
academic period: Academic Period 2010-2011

GradeOfStudentPerCourse 18
type: GradeOfStudentPerCourse
lesson rating: 6
student lesson rating: EconomicsCandidateStudent Test 41
student lesson: Databases

Mr Simeonidis
type: MemderOfInformatics FS
instractor with rank: Lecturer
coming from department of: CSD
is teaching: Databases
FS member of JPC IM: Not this period

CandidateStudentEvaluation 42
type: CandidateStudentEvaluation
grade and type of degree: 5.0
academic period: Academic Period 2010-2011
inverse of student valuation info: EconomicsCandidateStudent Test 41
publications: 6.0
professional activity: 8.0
language learning: 4.0
GMAT: 5.0
interview: 6.0

Mr Vassiliades
type: MemderOfInformatics FS
coming from department of: CSD
is teaching: Knowledge Management
supervising member from informatics FS: EconomicsCandidateStudent Test 41
instractor with rank: Associate Professor
FS member of JPC IM: Yes this period

Knowledge Management
type: OptionalLesson
taught by: Mr Vassiliades
lesson status: Optional

Internal control
type: OptionalLesson
lesson status: Optional
taught by: Mr Spathis

Mr Agelis
type: MemderOfInformatics FS
coming from department of: CSD
supervising member from informatics FS: InformaticsCandidateStudent Test 22
is teaching: Research Methodology and Data Analysis
is teaching: Simulation in Management
instractor with rank: Associate Professor
FS member of JPC IM: Yes this period

Research Methodology and Data Analysis
type: OptionalLesson
lesson status: Optional
taught by: Mr Agelis

Simulation in Management
type: OptionalLesson
lesson status: Optional
taught by: Mr Agelis

GradeOfStudentPerCourse 13
type: GradeOfStudentPerCourse
student lesson: Business Management
lesson rating: 10
student lesson rating: InformaticsCandidateStudent Test 22

CandidateStudentEvaluation 26
type: CandidateStudentEvaluation
language learning: 4.0
GMAT: 9.0
professional activity: 7.0
publications: 5.0
inverse of student valuation info: InformaticsCandidateStudent Test 22
interview: 6.0
academic period: Academic Period 2010-2011
grade and type of degree: 8.0

Lesson Evaluation 2010
type: LessonEvaluation
academic period: Academic Period 2010-2011
inverse of lesson valuation info: Business Management
avaluations average price: 7.8

Rule-13
type: Imp
body: ClassAtom
  argument1: z
  class predicate: InformaticsCandidateStudent
body: DatavaluedPropertyAtom
  property predicate: Valuation Average
  argument2: sum
  argument1: z
body: BuiltinAtom
  arguments: MySet
  arguments: sum
  builtin: makeBag
body: BuiltinAtom
  arguments: MySet2
  arguments: MySet
  arguments: 5
  builtin: greatestN
body: BuiltinAtom
  arguments: e
  arguments: MySet2
  builtin: element
body: BuiltinAtom
  builtin: equal
  arguments: e
  arguments: sum
head: DatavaluedPropertyAtom
  argument2: true
  argument1: z
  property predicate: Valuation Base Pass True
is rule enabled: true

Rule-12
type: Imp
body: ClassAtom
  class predicate: CandidateInformaticsStudent
  argument1: z
body: DatavaluedPropertyAtom
  argument2: sum
  argument1: z
  property predicate: Valuation Average
head: BuiltinAtom
  arguments: z
  arguments: sum
  builtin: select
head: BuiltinAtom
  builtin: orderByDescending
  arguments: sum
head: BuiltinAtom
  builtin: limit
  arguments: 5
is rule enabled: false
head: BuiltinAtom
  builtin: select
  arguments: z
  arguments: sum
head: BuiltinAtom
  builtin: orderByDescending
  arguments: sum
head: BuiltinAtom
  arguments: 5
  builtin: limit
body: ClassAtom
  class predicate: InformaticsCandidateStudent
  argument1: z
body: DatavaluedPropertyAtom
  argument2: sum
  argument1: z
  property predicate: Valuation Average

Degree Student who Finish JPC IM
type: Imp
head: DatavaluedPropertyAtom
  argument1: p
  argument2: true
  property predicate: Student Takes a Degree
body: ClassAtom
  class predicate: Student
  argument1: p
body: DatavaluedPropertyAtom
  argument2: true
  argument1: p
  property predicate: Student Pass All Lessons
body: DatavaluedPropertyAtom
  property predicate: Student Finish his Thesis
  argument2: true
  argument1: p
is rule enabled: true

DataRange
one of: Χειμερινό εξάμηνο
one of: Εαρινό εξάμηνο

Les Student Lesson Pass
type: Imp
is rule enabled: true
head: ClassAtom
  class predicate: OldCourses
  argument1: x
head: DatavaluedPropertyAtom
  argument2: true
  argument1: x
  property predicate: Student Lesson Pass
body: ClassAtom
  class predicate: GradeOfStudentPerCourse
  argument1: x
body: DatavaluedPropertyAtom
  property predicate: Lesson Rating
  argument2: Rate
  argument1: x
body: BuiltinAtom
  builtin: greaterThan
  arguments: Rate
  arguments: 5.9

Secretariat ensures
type: Process That Secretariat Arranges
academic period: Academic Period 2009-2010
comment: •the timely availability of forms from the website of the Department •the completion of the (printed or electronic) correspondence with the nominations (receiving, sending printed) •the collection and filing of applications and attachments to these documents and are forwarded and to Governing Board (GB) •the work with all relevant records.
comment: The secretariat of the JPC IM assist the GB:

DataRange
one of: Other
one of: Student
one of: Teaches

Def Postgraduate Student
type: Imp
body: ClassAtom
  argument1: x
  class predicate: Student
body: DatavaluedPropertyAtom
  argument1: x
  argument2: true
  property predicate: Student who Pass the Valuation
is rule enabled: true
head: ClassAtom
  argument1: x
  class predicate: PostgraduateStudentSelection

Degree Student Pass All Lessons
type: Imp
is rule enabled: true
body: ClassAtom
  argument1: p
  class predicate: Student
body: DatavaluedPropertyAtom
  property predicate: Student Lessons Number Pass
  argument2: Number
  argument1: p
body: BuiltinAtom
  builtin: greaterThan
  arguments: Number
  arguments: 11
head: DatavaluedPropertyAtom
  argument1: p
  argument2: true
  property predicate: Student Pass All Lessons

DataRange
one of: 0.4

DataRange
one of: 0.07

CandidateStudentEvaluation 4
type: CandidateStudentEvaluation
publications: 0.0
GMAT: 3.0
language learning: 5.0
interview: 2.0
professional activity: 0.0
academic period: Academic Period 2011-2012
grade and type of degree: 2.0

DataRange
one of: Αναγνωρισμένοι_Ερευνητές_κάτοχοι_Διδακτορικού
one of: Επισκέπτες_Καθηγητές_απο_το_εξωτερικό
one of: Επιστήμονες_Αναγνωρισμένου_Κύρους
one of: Μέλη_ΔΕΠ_άλλων_Τμημάτων
one of: Μέλη_Επιστημονικού_Προσωπικού_κάτοχοι_Διδακτορικού
one of: Ομότιμοι_Επισκέπτες_Καθηγητές_ή_Ειδικοί_Επιστήμονες
one of: Μέλος_ΔΕΠ_Πληροφορικής
one of: Μέλος_ΔΕΠ_Οικονομικού

JPC IM Evaluation 2008-2009
type: DepartmentEvaluation
academic period: Academic Period 2008-2009
avaluation comment: Improving facilities
avaluations average price: 8.8

DataRange
one of: Not this period
one of: Yes this period

CandidatesSupportingdocuments
type: Collection Of Candidates Necessary Documents
academic period: Academic Period 2009-2010
comment: • Application (form, accessible on the website of the respective sections). • Biography. • Certified copy of degree or diploma. • Certificate of equivalence and correspondence from DOATAP (where applicable). • Certified copies of any recognized postgraduate qualifications. • Validated certificate or transcript of undergraduate and postgraduate studies. • Establishment of the Secretariat of the Board of leaving his / her candidate's, showing the number of graduation or series scores than other students (when available) • The performance of the test GMAT. • Two (2) letters of recommendation (mandatory). • Evidence of knowledge of foreign languages ??for the Greeks or the Greek foreign (Lower, Proficiency, etc., a certificate of competence from the Greek language Greek Language Center for Foreigners). • Evidence of research activities (if any). • Photocopy of identity card or passport. • Two (2) photos. • Fee-examination form, the amount of which will be decided at the beginning of each academic year of the SAD, payable to an account of the Research Committee of AUTH after approval by the Research Committee of AUTH.
comment: The documents that must be submit to the principal by the candidates are:

Les Lessons Number Student Pass
type: Imp
is rule enabled: true
head: BuiltinAtom
  builtin: select
  arguments: Number
head: DatavaluedPropertyAtom
  argument1: y
  argument2: Number
  property predicate: Student Lessons Number Pass
body: ClassAtom
  argument1: y
  class predicate: Student
body: IndividualPropertyAtom
  property predicate: Student Lesson Rating
  argument1: x
  argument2: y
body: DatavaluedPropertyAtom
  argument2: true
  argument1: x
  property predicate: Student Lesson Pass
body: BuiltinAtom
  builtin: makeSet
  arguments: MySet
  arguments: x
body: BuiltinAtom
  builtin: groupBy
  arguments: MySet
  arguments: y
body: BuiltinAtom
  builtin: size
  arguments: Number
  arguments: MySet

Def Student of Informatics Direction
type: Imp
is rule enabled: true
body: ClassAtom
  argument1: x
  class predicate: EconomicsCandidateStudent
body: DatavaluedPropertyAtom
  property predicate: Student who Pass the Valuation
  argument1: x
  argument2: true
head: ClassAtom
  argument1: x
  class predicate: InformaticsDirectionStudent

Les Best Student Lessons Average
type: Imp
head: BuiltinAtom
  arguments: p
  arguments: MyAvg
  builtin: select
head: BuiltinAtom
  builtin: max
  arguments: MyAvg
is rule enabled: true
body: ClassAtom
  argument1: p
  class predicate: Student
body: DatavaluedPropertyAtom
  property predicate: Student Lessons Average Rating
  argument1: p
  argument2: MyAvg

DataRange
one of: 0.05

Mr Paleokostas
type: OtherPerson
coming from department of: Other

Def Average for Candidates Application Evaluation
type: Imp
body: ClassAtom
  argument1: z
  class predicate: CandidateStudentEvaluation
body: DatavaluedPropertyAtom
  property predicate: Grade and Type of Degree
  argument2: a
  argument1: z
body: BuiltinAtom
  arguments: sum1
  arguments: 0.4
  arguments: a
  builtin: multiply
body: DatavaluedPropertyAtom
  argument1: z
  argument2: b
  property predicate: GMAT
body: BuiltinAtom
  builtin: multiply
  arguments: sum2
  arguments: 0.25
  arguments: b
body: DatavaluedPropertyAtom
  property predicate: Language learning
  argument1: z
  argument2: c
body: BuiltinAtom
  arguments: sum3
  arguments: 0.15
  arguments: c
  builtin: multiply
body: DatavaluedPropertyAtom
  argument2: d
  argument1: z
  property predicate: Publications
body: BuiltinAtom
  builtin: multiply
  arguments: sum4
  arguments: 0.08
  arguments: d
body: DatavaluedPropertyAtom
  argument1: z
  argument2: e
  property predicate: Professional Activity
body: BuiltinAtom
  builtin: multiply
  arguments: sum5
  arguments: 0.05
  arguments: e
body: DatavaluedPropertyAtom
  property predicate: Interview
  argument2: f
  argument1: z
body: BuiltinAtom
  builtin: multiply
  arguments: sum6
  arguments: 0.07
  arguments: f
body: BuiltinAtom
  builtin: add
  arguments: add1
  arguments: sum1
  arguments: sum2
body: BuiltinAtom
  builtin: add
  arguments: add2
  arguments: sum3
  arguments: sum4
body: BuiltinAtom
  arguments: add3
  arguments: sum5
  arguments: sum6
  builtin: add
body: BuiltinAtom
  arguments: add
  arguments: add1
  arguments: add2
  builtin: add
body: BuiltinAtom
  builtin: add
  arguments: sum
  arguments: add
  arguments: add3
body: IndividualPropertyAtom
  argument1: z
  property predicate: inverse of Student Valuation Info
  argument2: stud
is rule enabled: true
head: DatavaluedPropertyAtom
  argument2: sum
  property predicate: Valuation Average
  argument1: stud

Def Student of Financial Direction
type: Imp
head: ClassAtom
  class predicate: EconomicsDirectionStudent
  argument1: x
is rule enabled: true
body: ClassAtom
  argument1: x
  class predicate: InformaticsCandidateStudent
body: DatavaluedPropertyAtom
  property predicate: Student who Pass the Valuation
  argument1: x
  argument2: true

CandidateStudentEvaluation 68
type: CandidateStudentEvaluation
inverse of student valuation info: EconomicsCandidateStudent 25
grade and type of degree: 4.0
publications: 1.0
interview: 7.0
professional activity: 6.0
academic period: Academic Period 2010-2011
language learning: 6.0
GMAT: 7.0

CandidateStudentEvaluation 67
type: CandidateStudentEvaluation
interview: 5.0
GMAT: 4.0
grade and type of degree: 4.0
language learning: 0.0
professional activity: 1.0
publications: 1.0
academic period: Academic Period 2009-2010
inverse of student valuation info: EconomicsCandidateStudent 25

CandidateStudentEvaluation 66
type: CandidateStudentEvaluation
interview: 5.0
GMAT: 1.0
professional activity: 1.0
grade and type of degree: 4.0
language learning: 0.0
publications: 0.0
inverse of student valuation info: EconomicsCandidateStudent 25
academic period: Academic Period 2008-2009

CandidateStudentEvaluation 65
type: CandidateStudentEvaluation
grade and type of degree: 5.0
inverse of student valuation info: EconomicsCandidateStudent 23
professional activity: 5.0
publications: 1.0
interview: 5.0
language learning: 5.0
GMAT: 5.0
academic period: Academic Period 2010-2011

CandidateStudentEvaluation 64
type: CandidateStudentEvaluation
publications: 1.0
academic period: Academic Period 2009-2010
inverse of student valuation info: EconomicsCandidateStudent 23
language learning: 1.0
interview: 5.0
grade and type of degree: 5.0
GMAT: 1.0
professional activity: 1.0

CandidateStudentEvaluation 29
type: CandidateStudentEvaluation
interview: 5.0
language learning: 5.0
grade and type of degree: 5.0
academic period: Academic Period 2010-2011
professional activity: 5.0
GMAT: 8.0
inverse of student valuation info: EconomicsCandidateStudent 28
publications: 0.0

CandidateStudentEvaluation 17
type: CandidateStudentEvaluation
publications: 0.0
inverse of student valuation info: InformaticsCandidateStudent 46
interview: 4.0
academic period: Academic Period 2009-2010
professional activity: 0.0
language learning: 5.0
grade and type of degree: 4.0
GMAT: 4.0

CandidateStudentEvaluation 35
type: CandidateStudentEvaluation
professional activity: 4.0
inverse of student valuation info: EconomicsCandidateStudent 34
publications: 5.0
interview: 5.0
academic period: Academic Period 2010-2011
language learning: 4.0
grade and type of degree: 4.0
GMAT: 4.0

CandidateStudentEvaluation 31
type: CandidateStudentEvaluation
inverse of student valuation info: EconomicsCandidateStudent 30
interview: 4.0
grade and type of degree: 9.0
publications: 0.0
language learning: 0.0
professional activity: 6.0
GMAT: 0.0
academic period: Academic Period 2010-2011

CandidateStudentEvaluation 16
type: CandidateStudentEvaluation
academic period: Academic Period 2010-2011
publications: 7.0
GMAT: 2.0
grade and type of degree: 8.0
professional activity: 7.0
inverse of student valuation info: InformaticsCandidateStudent 45
language learning: 7.0
interview: 7.0

CandidateStudentEvaluation 13
type: CandidateStudentEvaluation
publications: 6.0
inverse of student valuation info: InformaticsCandidateStudent 42
interview: 5.0
academic period: Academic Period 2010-2011
language learning: 5.0
professional activity: 5.0
GMAT: 4.0
grade and type of degree: 5.0

CandidateStudentEvaluation 27
type: CandidateStudentEvaluation
interview: 8.0
professional activity: 7.0
language learning: 8.0
publications: 6.0
inverse of student valuation info: EconomicsCandidateStudent 26
grade and type of degree: 7.0
academic period: Academic Period 2010-2011
GMAT: 6.0

Mrs Plakogiannaki
type: Visiting Professors from abroad
has degree related to: Other
FS member of JPC IM: Not this period
instractor with rank: Lecturer
is teaching: Consumer Behavior

Consumer Behavior
type: OptionalLesson
taught by: Mrs Plakogiannaki
lesson status: Optional

Information Technology Law
type: OptionalLesson
taught by: Mr Inglezakis
semester: 2
lesson status: Optional

Mr Inglezakis
type: Faculty Members from other Departments
is teaching: Information Technology Law
has degree related to: Other
FS member of JPC IM: Not this period
instractor with rank: Assistant Professor

Data Mining
type: OptionalLesson
lesson status: Optional
taught by: Mr A Papadopoulos

CandidateStudentEvaluation 9
type: CandidateStudentEvaluation
language learning: 2.0
academic period: Academic Period 2010-2011
publications: 2.0
interview: 3.0
inverse of student valuation info: InformaticsCandidateStudent 38
grade and type of degree: 3.0
professional activity: 3.0
GMAT: 4.0

CandidateStudentEvaluation 10
type: CandidateStudentEvaluation
inverse of student valuation info: InformaticsCandidateStudent 39
grade and type of degree: 4.0
GMAT: 8.0
interview: 4.0
language learning: 6.0
professional activity: 4.0
academic period: Academic Period 2010-2011
publications: 4.0

CandidateStudentEvaluation 12
type: CandidateStudentEvaluation
professional activity: 4.0
academic period: Academic Period 2010-2011
inverse of student valuation info: InformaticsCandidateStudent 41
publications: 6.0
GMAT: 7.0
grade and type of degree: 7.0
interview: 5.0
language learning: 7.0

CandidateStudentEvaluation 62
type: CandidateStudentEvaluation
GMAT: 0.0
language learning: 7.0
interview: 7.0
grade and type of degree: 6.0
professional activity: 7.0
publications: 7.0
inverse of student valuation info: EconomicsCandidateStudent 21
academic period: Academic Period 2010-2011

CandidateStudentEvaluation 18
type: CandidateStudentEvaluation
professional activity: 7.0
grade and type of degree: 6.0
academic period: Academic Period 2010-2011
publications: 3.0
inverse of student valuation info: InformaticsCandidateStudent 47
GMAT: 2.0
interview: 2.0
language learning: 3.0

CandidateStudentEvaluation 15
type: CandidateStudentEvaluation
professional activity: 7.0
interview: 5.0
language learning: 2.0
GMAT: 5.0
grade and type of degree: 4.0
academic period: Academic Period 2010-2011
inverse of student valuation info: InformaticsCandidateStudent 44
publications: 4.0

CandidateStudentEvaluation 11
type: CandidateStudentEvaluation
GMAT: 3.0
language learning: 8.0
grade and type of degree: 8.0
academic period: Academic Period 2010-2011
professional activity: 8.0
interview: 6.0
inverse of student valuation info: InformaticsCandidateStudent 40
publications: 7.0

CandidateStudentEvaluation 33
type: CandidateStudentEvaluation
academic period: Academic Period 2010-2011
language learning: 7.0
GMAT: 7.0
inverse of student valuation info: EconomicsCandidateStudent 32
professional activity: 3.0
interview: 8.0
grade and type of degree: 3.0
publications: 1.0

CandidateStudentEvaluation 63
type: CandidateStudentEvaluation
academic period: Academic Period 2010-2011
publications: 9.0
GMAT: 9.0
grade and type of degree: 9.0
inverse of student valuation info: EconomicsCandidateStudent 22
professional activity: 9.0
language learning: 9.0
interview: 9.0

CandidateStudentEvaluation 14
type: CandidateStudentEvaluation
inverse of student valuation info: InformaticsCandidateStudent 43
grade and type of degree: 5.0
professional activity: 5.0
interview: 5.0
language learning: 5.0
academic period: Academic Period 2010-2011
GMAT: 5.0
publications: 5.0

Mrs Kaitatzi
type: Faculty Members from other Departments
has degree related to: Other
is teaching: Public Relations
FS member of JPC IM: Not this period

Public Relations
type: OptionalLesson
lesson status: Optional
taught by: Mrs Kaitatzi